{"text_format":"1","workbook":"xlsx","n_sheets":6,"sheets":["Indtastning","Seriediagram","Beregninger","Distributionsliste","Skjulte_Indstillinger","Licens"],"not_rendered":{"charts":1,"images":16,"macros":1,"external_links":0,"defined_names":44,"comments":1,"pivot_tables":0},"unopened":[],"bounds":{"document_bytes":16777216,"sheet_cells":100000,"rows_first":2000,"rows_last":500,"rows_between":2000,"halvings":0,"cell_chars":16384,"cell_head_chars":4096},"cells_cut":0,"cells_raw":0,"read":"whole","date_system":"1900"}

{"sheet":"Indtastning","index":0,"n_rows":79,"n_cols":35,"rows_kept":79,"cut":false,"hidden":false,"merged":[[2,0,2,1],[2,2,2,5],[2,6,2,8],[12,6,12,8],[13,6,13,8],[7,6,7,8],[8,6,8,8],[9,6,9,8],[11,6,11,8],[6,2,9,5],[10,0,13,1],[10,2,13,5],[5,0,5,1],[5,2,5,5],[5,6,5,8],[6,0,9,1],[3,0,3,1],[3,2,3,5],[3,6,3,8],[4,0,4,1],[4,2,4,5],[15,26,15,28],[15,29,15,31],[15,32,15,34],[16,1,16,2],[17,6,17,7],[15,3,15,5],[14,32,14,34],[15,6,16,7],[15,8,15,10],[15,11,15,13],[15,14,15,16],[15,17,15,19],[15,20,15,22],[15,23,15,25],[14,14,14,16],[14,17,14,19],[14,20,14,22],[14,23,14,25],[14,26,14,28],[14,29,14,31],[14,3,14,5],[14,8,14,10],[14,11,14,13],[29,6,29,7],[24,6,24,7],[25,6,25,7],[26,6,26,7],[21,6,21,7],[22,6,22,7],[23,6,23,7],[18,6,18,7],[19,6,19,7],[20,6,20,7],[36,6,36,7],[37,6,37,7],[38,6,38,7],[33,6,33,7],[34,6,34,7],[35,6,35,7],[17,1,17,2],[18,1,18,2],[19,1,19,2],[20,1,20,2],[21,1,21,2],[22,1,22,2],[23,1,23,2],[24,1,24,2],[25,1,25,2],[26,1,26,2],[27,1,27,2],[28,1,28,2],[29,1,29,2],[30,6,30,7],[31,6,31,7],[32,6,32,7],[27,6,27,7],[28,6,28,7],[43,6,43,7],[44,6,44,7],[39,6,39,7],[40,6,40,7],[41,6,41,7],[46,1,46,2],[47,1,47,2],[48,1,48,2],[48,6,48,7],[49,6,49,7],[50,6,50,7],[45,6,45,7],[46,6,46,7],[47,6,47,7],[50,1,50,2],[49,1,49,2],[30,1,30,2],[31,1,31,2],[32,1,32,2],[33,1,33,2],[34,1,34,2],[35,1,35,2],[36,1,36,2],[37,1,37,2],[38,1,38,2],[39,1,39,2],[40,1,40,2],[41,1,41,2],[42,1,42,2],[43,1,43,2],[44,1,44,2],[45,1,45,2],[42,6,42,7],[54,1,54,2],[54,6,54,7],[55,1,55,2],[55,6,55,7],[56,1,56,2],[56,6,56,7],[51,1,51,2],[51,6,51,7],[52,1,52,2],[52,6,52,7],[53,1,53,2],[53,6,53,7],[60,1,60,2],[60,6,60,7],[61,1,61,2],[61,6,61,7],[62,1,62,2],[62,6,62,7],[57,1,57,2],[57,6,57,7],[58,1,58,2],[58,6,58,7],[59,1,59,2],[59,6,59,7],[66,1,66,2],[66,6,66,7],[67,1,67,2],[67,6,67,7],[68,1,68,2],[68,6,68,7],[63,1,63,2],[63,6,63,7],[64,1,64,2],[64,6,64,7],[65,1,65,2],[65,6,65,7],[11,9,11,11],[12,9,12,11],[13,9,13,11],[78,1,78,2],[78,6,78,7],[1,0,1,5],[75,1,75,2],[75,6,75,7],[76,1,76,2],[76,6,76,7],[77,1,77,2],[77,6,77,7],[72,1,72,2],[72,6,72,7],[73,1,73,2],[73,6,73,7],[74,1,74,2],[74,6,74,7],[69,1,69,2],[69,6,69,7],[70,1,70,2],[70,6,70,7],[71,1,71,2],[71,6,71,7],[0,12,0,19],[1,6,1,11],[10,6,10,11],[6,6,6,11],[2,9,2,11],[3,9,3,11],[5,9,5,11],[7,9,7,11],[8,9,8,11],[9,9,9,11]]}
["Indstillinger for seriediagram",null,null,null,null,null,null,null,null,null,null,null,"Forhåndsvisning"]
["Grundlæggende oplysninger",null,null,null,null,null,"Talformat"]
["Titel",null,null,null,null,null,"Input",null,null,"Tal (0 decimaler)"]
["Afdeling/Afsnit",null,null,null,null,null,"Output",null,null,"Tal (0 decimaler)"]
["Periode",null,null,null,null,null,"Indstillinger for X-akse"]
["Datakilde",null,null,null,null,null,"Format",null,null,"Tekst"]
["Datadefinition",null,null,null,null,null,"Indstillinger for Y-akse",null,null,null,null,null,null,null,{"$f":"Beregninger!C98","v":0}]
[null,null,null,null,null,null,"Titel",null,null,null,null,null,null,null,{"$f":"Beregninger!C96","v":0}]
{"$rows_left_out":72}
{"sheet":"Seriediagram","index":1,"n_rows":37,"n_cols":20,"rows_kept":37,"cut":false,"hidden":false,"merged":[[33,14,35,15],[36,14,38,15],[32,14,32,15],[1,0,2,20],[0,0,0,20],[33,17,35,17],[36,17,38,17],[33,19,38,19],[31,5,31,7],[31,9,31,11],[31,15,31,20],[4,0,4,19],[5,0,5,19],[33,1,38,1],[33,3,38,3],[32,5,38,7],[32,9,38,11],[33,13,35,13],[36,13,38,13]]}
[{"$f":"IF(Indtastning!C3=\"\",\"\",Indtastning!C3)","v":""}]
[{"$f":"IF(Indtastning!C4=\"\",\"\",Indtastning!C4)","v":""}]
[]
[]
[{"$f":"IF(ingenData=FALSE,Beregninger!C109&\" \"&\nIF(OR(Beregninger!C98=0,Beregninger!C98=1,Beregninger!C98=2),\"  ●   Gns. obs. \"&\nCHOOSE(IF(Beregninger!$C$100>0,1,2),ROUND(_xlfn.AGGREGATE(1,3,dgrTællerEfter),1),ROUND(_xlfn.AGGREGATE(1,3,dgrTællerFør),1))&\n\nIF(CHOOSE(IF(Beregninger!$C$100>0,1,2),ROUND(_xlfn.AGGREGATE(1,3,dgrNævnerEfter),1),ROUND(_xlfn.AGGREGATE(1,3,dgrNævnerFør),1))=1,\"\",\n\"/\"&CHOOSE(IF(Beregninger!$C$100>0,1,2),ROUND(_xlfn.AGGREGATE(1,3,dgrNævnerEfter),1),ROUND(_xlfn.AGGREGATE(1,3,dgrNævnerFør),1)))\n\n\n\n\n&\"; seneste obs. (\"&LOOKUP(2,1/(Beregninger!D6:D67<>\"\"),Beregninger!D6:D67)&\"): \"&ROUND(LOOKUP(2,1/(Beregninger!E6:E67<>\"\"),Beregninger!E6:E67),2)&\nIF(CHOOSE(IF(Beregninger!$C$100>0,1,2),ROUND(_xlfn.AGGREGATE(1,3,dgrNævnerEfter),1),ROUND(_xlfn.AGGREGATE(1,3,dgrNævnerFør),1))=1,\"\",\n\"/\"&ROUND(LOOKUP(2,1/(Beregninger!F6:F67<>\"\"),Beregninger!F6:F67),2)&\".\"),\"\"),\"\")","v":""}]
[{"$f":"IF(ingenData=FALSE,\"Periode: \"&IF(Beregninger!C108=\"\",Beregninger!C113,Beregninger!C108)&IF(Beregninger!C105=1,\"   ●   Foruddefineret median: \"&Beregninger!C102,\"\")&IF(Beregninger!C103=\"\",\"\",\"   ●   Seneste median: \"&Beregninger!C103&\" (\"&VLOOKUP(Beregninger!C100+1,Beregninger!A6:'Beregninger'!D67,4)&\" - \"&LOOKUP(2,1/(Beregninger!D6:D67<>\"\"),Beregninger!D6:D67)&\")\"),\"\")","v":""}]
[null,null,null,null,null,null,null,null,null,null,null,null,null,null,null,null,"Max",{"$f":"Beregninger!C91","v":105}]
[null,null,null,null,null,null,null,null,null,null,null,null,null,null,null,null,"Min",{"$f":"Beregninger!C92","v":""}]
{"$rows_left_out":30}
{"sheet":"Beregninger","index":2,"n_rows":132,"n_cols":81,"rows_kept":132,"cut":false,"hidden":true,"merged":[[2,4,2,5],[2,6,2,7],[2,59,2,60],[2,8,2,9],[2,10,2,11],[2,12,2,13],[2,14,2,15],[2,16,2,17],[2,18,2,19],[2,20,2,21],[2,22,2,23],[2,24,2,25],[2,26,2,27],[2,28,2,29],[2,30,2,31],[2,32,2,33],[2,34,2,35],[2,36,2,37],[2,38,2,39],[2,40,2,41],[2,42,2,43]]}
[]
[]
["Nr","Obs #","Format","X-akse tekst","Data1",null,"Andel1",null,"Data2",null,"Andel2",null,"Data3",null,"Andel3",null,"Data4",null,"Andel4",null,"Data5",null,"Andel5",null,"Data6",null,"Andel6",null,"Data7",null,"Andel7",null,"Data8",null,"Andel8",null,"Data9",null,"Andel9",null,"Data10",null,"Andel10",null,"Kommentar","Kommentar_værdi",null,"Max data","Min data","Max","Min","Nedre","Øvre","Indikatator for skift","Andel før skift","Andel efter skift","Median1","Median2","Median","Data på\nMedianen",null,"Delta","Fortegn","Ignorer median","Kryds af median","Længde af forløb","Brugbar observation","Længde af forløb (Før skift)","Længde af forløb (Efter skift)","Mål","Måltitel",{"$f":"Indtastning!$D$15","v":"Titel proces 1"},{"$f":"Indtastning!$I$15","v":"Titel proces 2"},{"$f":"Indtastning!L15","v":"Titel proces 3"},{"$f":"Indtastning!O15","v":"Titel proces 4"},{"$f":"Indtastning!R15","v":"Titel proces 5"},{"$f":"Indtastning!U15","v":"Titel proces 6"},{"$f":"Indtastning!X15","v":"Titel proces 7"},{"$f":"Indtastning!AA15","v":"Titel proces 8"},{"$f":"Indtastning!AD15","v":"Titel proces 9"},{"$f":"Indtastning!AG15","v":"Titel proces 10"}]
[null,null,null,null,"Tæller ","Nævner",null,null,"Tæller ","Nævner",null,null,"Tæller ","Nævner",null,null,"Tæller ","Nævner",null,null,"Tæller ","Nævner",null,null,"Tæller ","Nævner",null,null,"Tæller ","Nævner",null,null,"Tæller ","Nævner",null,null,"Tæller ","Nævner",null,null,"Tæller ","Nævner",null,null,null,null,null,null,null,null,null,null,null,null,null,null,null,{"$f":"MEDIAN(BD6:BD65)","v":{"$error":"#NUM!"}},null,null,null,null,null,null,null,null,null,null,null,null,"MÅL"]
[null,null,null,null,null,null,null,null,null,null,null,null,null,null,null,null,null,null,null,null,null,null,null,null,null,null,null,null,null,null,null,null,null,null,null,null,null,null,null,null,null,null,null,null,null,null,null,null,null,null,null,null,null,null,null,null,{"$f":"IF(Indtastning!J13=\"\",IFERROR(MEDIAN(BC6:BC67),NA()),Indtastning!J13)","v":{"$error":"#N/A"}},null,{"$f":"MEDIAN(H6:H65)","v":{"$error":"#NUM!"}},null,null,null,null,null,null,null,null,null,null,{"$f":"VALUE(SUBSTITUTE(IF(Indtastning!J14=\"\",#N/A,Indtastning!J14),\"<\",\"\"))","v":{"$error":"#N/A"}}]
[{"$f":"IF(B6=\"\",\"\",ROW(A1))","v":""},{"$f":"IF(Indtastning!B18=\"\",\"\",Indtastning!B18)","v":""},{"$f":"CELL(\"format\",Indtastning!B18)","v":"G"},{"$f":"IF(LEFT(C6,1)=\"D\",TEXT(B6,\"mmm-åååå\"),TEXT(B6,\"standard\"))","v":""},{"$f":"IF(Indtastning!D18=\"\",\"\",Indtastning!D18)","v":""},{"$f":"IF(Indtastning!E18=\"\",\"\",Indtastning!E18)","v":""},{"$f":"IF(OR(F6=\"\",F6=0),#N/A,E6/F6)","v":{"$error":"#N/A"}},{"$f":"IF(ISNUMBER(G6),G6,\"\")","v":""},{"$f":"IF(Indtastning!I18=\"\",\"\",Indtastning!I18)","v":""},{"$f":"IF(Indtastning!J18=\"\",\"\",Indtastning!J18)","v":""},{"$f":"IF(OR(J6=\"\",J6=0,Skjulte_Indstillinger!$B$2=FALSE()),#N/A,I6/J6)","v":{"$error":"#N/A"}},{"$f":"IF(ISNUMBER(K6),K6,\"\")","v":""},{"$f":"IF(Indtastning!L18=\"\",\"\",Indtastning!L18)","v":""},{"$f":"IF(Indtastning!M18=\"\",\"\",Indtastning!M18)","v":""},{"$f":"IF(OR(N6=\"\",N6=0,Skjulte_Indstillinger!$B$3=FALSE()),#N/A,M6/N6)","v":{"$error":"#N/A"}},{"$f":"IF(ISNUMBER(O6),O6,\"\")","v":""},{"$f":"IF(Indtastning!O18=\"\",\"\",Indtastning!O18)","v":""},{"$f":"IF(Indtastning!P18=\"\",\"\",Indtastning!P18)","v":""},{"$f":"IF(OR(R6=\"\",R6=0,Skjulte_Indstillinger!$B$4=FALSE()),#N/A,Q6/R6)","v":{"$error":"#N/A"}},{"$f":"IF(ISNUMBER(S6),S6,\"\")","v":""},{"$f":"IF(Indtastning!R18=\"\",\"\",Indtastning!R18)","v":""},{"$f":"IF(Indtastning!S18=\"\",\"\",Indtastning!S18)","v":""},{"$f":"IF(OR(V6=\"\",V6=0,Skjulte_Indstillinger!$B$5=FALSE()),#N/A,U6/V6)","v":{"$error":"#N/A"}},{"$f":"IF(ISNUMBER(W6),W6,\"\")","v":""},{"$f":"IF(Indtastning!U18=\"\",\"\",Indtastning!U18)","v":""},{"$f":"IF(Indtastning!V18=\"\",\"\",Indtastning!V18)","v":""},{"$f":"IF(OR(Z6=\"\",Z6=0,Skjulte_Indstillinger!$B$6=FALSE()),#N/A,Y6/Z6)","v":{"$error":"#N/A"}},{"$f":"IF(ISNUMBER(AA6),AA6,\"\")","v":""},{"$f":"IF(Indtastning!X18=\"\",\"\",Indtastning!X18)","v":""},{"$f":"IF(Indtastning!Y18=\"\",\"\",Indtastning!Y18)","v":""},{"$f":"IF(OR(AD6=\"\",AD6=0,Skjulte_Indstillinger!$B$7=FALSE()),#N/A,AC6/AD6)","v":{"$error":"#N/A"}},{"$f":"IF(ISNUMBER(AE6),AE6,\"\")","v":""},{"$f":"IF(Indtastning!AA18=\"\",\"\",Indtastning!AA18)","v":""},{"$f":"IF(Indtastning!AB18=\"\",\"\",Indtastning!AB18)","v":""},{"$f":"IF(OR(AH6=\"\",AH6=0,Skjulte_Indstillinger!$B$8=FALSE()),#N/A,AG6/AH6)","v":{"$error":"#N/A"}},{"$f":"IF(ISNUMBER(AI6),AI6,\"\")","v":""},{"$f":"IF(Indtastning!AD18=\"\",\"\",Indtastning!AD18)","v":""},{"$f":"IF(Indtastning!AE18=\"\",\"\",Indtastning!AE18)","v":""},{"$f":"IF(OR(AL6=\"\",AL6=0,Skjulte_Indstillinger!$B$9=FALSE()),#N/A,AK6/AL6)","v":{"$error":"#N/A"}},{"$f":"IF(ISNUMBER(AM6),AM6,\"\")","v":""},{"$f":"IF(Indtastning!AG18=\"\",\"\",Indtastning!AG18)","v":""},{"$f":"IF(Indtastning!AH18=\"\",\"\",Indtastning!AH18)","v":""},{"$f":"IF(OR(AP6=\"\",AP6=0,Skjulte_Indstillinger!$B$10=FALSE()),#N/A,AO6/AP6)","v":{"$error":"#N/A"}},{"$f":"IF(ISNUMBER(AQ6),AQ6,\"\")","v":""},{"$f":"IF(Indtastning!G18=\"\",#N/A,Indtastning!G18)","v":{"$error":"#N/A"}},{"$f":"IF(AS6=\"\",#N/A,IF(MATCH(MAX(AZ6:BA6),AZ6:BA6)=2,\n(AV6+(BA6/2))*IF(ISEVEN(AU6),(1-(2/10)),(1+(2/10))),\n(AW6-(AZ6/2))*IF(ISEVEN(AU6),(1-(2/10)),(1+(2/10)))\n))","v":{"$error":"#N/A"}},{"$f":"_xlfn.AGGREGATE(3,3,$AS$6:$AS6)","v":0},{"$f":"_xlfn.AGGREGATE(4,3,$G3:$G8)","v":0},{"$f":"_xlfn.AGGREGATE(5,3,$G3:$G8)","v":0},{"$f":"MAX(_xlfn.AGGREGATE(4,3,$G3:$G8),IFERROR($BR$5,0))","v":0},0,{"$f":"AW6-AY6","v":0},{"$f":"AX6-AV6","v":0},{"$f":"IF(OR(A6=$C$101,BB5=1),1,0)","v":0},{"$f":"IF(BB6=0,H6,\"\")","v":""},{"$f":"IF(BB6=1,H6,\"\")","v":""},{"$f":"IF(BB6=0,$BE$5,#N/A)","v":{"$error":"#N/A"}},{"$f":"IF(OR(BB6=1,BB7=1),$BF$4,#N/A)","v":{"$error":"#N/A"}},{"$f":"IF(BB6=0,BE6,BF6)","v":{"$error":"#N/A"}},{"$f":"IF(ISERROR(BG6),#N/A,IF(BG6=G6,G6,NA()))","v":{"$error":"#N/A"}},{"$f":"IF(ISNUMBER(BH6),1,0)","v":0},{"$f":"IF((H6=\"\"),\"\",IF((H6=BG6),\"\",H6-BG6))","v":""},{"$f":"IF(ISERROR(G6),\"\",IF((BJ6=\"\"),0,SIGN(BJ6)))","v":""},{"$f":"IF(BK6=0,BK5,BK6)","v":""},{"$f":"IF(ISERROR(G6),\"\",IF(OR(BL6=BL5,BL5=0),0,1))","v":""},{"$f":"IF(OR(BL6=0,BL6=\"\"),0,IF(AND(BB6=1,BB5=0),1,IF(BL6=BL5,IF(BI6=1,BN5,BN5+1),1)))","v":0},{"$f":"IF(BK6=\"\",0,ABS(BK6))","v":0},{"$f":"IF(BB6=0,BN6,\"\")","v":0},{"$f":"IF(BB6=1,BN6,\"\")","v":""},{"$f":"$BR$5","v":{"$error":"#N/A"}},{"$f":"BR6","v":{"$error":"#N/A"}},{"$f":"IF(AND(H6<>\"\",H7=\"\",OR(Skjulte_Indstillinger!$B$2,Skjulte_Indstillinger!$B$3,Skjulte_Indstillinger!$B$4,Skjulte_Indstillinger!$B$5,Skjulte_Indstillinger!$B$6,Skjulte_Indstillinger!$B$7,Skjulte_Indstillinger!$B$8,Skjulte_Indstillinger!$B$9,Skjulte_Indstillinger!$B$10)),H6,NA())","v":{"$error":"#N/A"}},{"$f":"IF(AND(L6<>\"\",L7=\"\",Skjulte_Indstillinger!$B$2),L6,NA())","v":{"$error":"#N/A"}},{"$f":"IF(AND(P6<>\"\",P7=\"\",Skjulte_Indstillinger!$B$3),P6,NA())","v":{"$error":"#N/A"}},{"$f":"IF(AND(T6<>\"\",T7=\"\",Skjulte_Indstillinger!$B$4),T6,NA())","v":{"$error":"#N/A"}},{"$f":"IF(AND(X6<>\"\",X7=\"\",Skjulte_Indstillinger!$B$5),X6,NA())","v":{"$error":"#N/A"}},{"$f":"IF(AND(AB6<>\"\",AB7=\"\",Skjulte_Indstillinger!$B$6),AB6,NA())","v":{"$error":"#N/A"}},{"$f":"IF(AND(AF6<>\"\",AF7=\"\",Skjulte_Indstillinger!$B$7),AF6,NA())","v":{"$error":"#N/A"}},{"$f":"IF(AND(AJ6<>\"\",AJ7=\"\",Skjulte_Indstillinger!$B$8),AJ6,NA())","v":{"$error":"#N/A"}},{"$f":"IF(AND(AN6<>\"\",AN7=\"\",Skjulte_Indstillinger!$B$9),AN6,NA())","v":{"$error":"#N/A"}},{"$f":"IF(AND(AR6<>\"\",AR7=\"\",Skjulte_Indstillinger!$B$10),AR6,NA())","v":{"$error":"#N/A"}}]
[{"$f":"IF(B7=\"\",\"\",ROW(A2))","v":""},{"$f":"IF(Indtastning!B19=\"\",\"\",Indtastning!B19)","v":""},{"$f":"CELL(\"format\",Indtastning!B19)","v":"G"},{"$f":"IF(LEFT(C7,1)=\"D\",TEXT(B7,\"mmm-åååå\"),TEXT(B7,\"standard\"))","v":""},{"$f":"IF(Indtastning!D19=\"\",\"\",Indtastning!D19)","v":""},{"$f":"IF(Indtastning!E19=\"\",\"\",Indtastning!E19)","v":""},{"$f":"IF(OR(F7=\"\",F7=0),#N/A,E7/F7)","v":{"$error":"#N/A"}},{"$f":"IF(ISNUMBER(G7),G7,\"\")","v":""},{"$f":"IF(Indtastning!I19=\"\",\"\",Indtastning!I19)","v":""},{"$f":"IF(Indtastning!J19=\"\",\"\",Indtastning!J19)","v":""},{"$f":"IF(OR(J7=\"\",J7=0,Skjulte_Indstillinger!$B$2=FALSE()),#N/A,I7/J7)","v":{"$error":"#N/A"}},{"$f":"IF(ISNUMBER(K7),K7,\"\")","v":""},{"$f":"IF(Indtastning!L19=\"\",\"\",Indtastning!L19)","v":""},{"$f":"IF(Indtastning!M19=\"\",\"\",Indtastning!M19)","v":""},{"$f":"IF(OR(N7=\"\",N7=0,Skjulte_Indstillinger!$B$3=FALSE()),#N/A,M7/N7)","v":{"$error":"#N/A"}},{"$f":"IF(ISNUMBER(O7),O7,\"\")","v":""},{"$f":"IF(Indtastning!O19=\"\",\"\",Indtastning!O19)","v":""},{"$f":"IF(Indtastning!P19=\"\",\"\",Indtastning!P19)","v":""},{"$f":"IF(OR(R7=\"\",R7=0,Skjulte_Indstillinger!$B$4=FALSE()),#N/A,Q7/R7)","v":{"$error":"#N/A"}},{"$f":"IF(ISNUMBER(S7),S7,\"\")","v":""},{"$f":"IF(Indtastning!R19=\"\",\"\",Indtastning!R19)","v":""},{"$f":"IF(Indtastning!S19=\"\",\"\",Indtastning!S19)","v":""},{"$f":"IF(OR(V7=\"\",V7=0,Skjulte_Indstillinger!$B$5=FALSE()),#N/A,U7/V7)","v":{"$error":"#N/A"}},{"$f":"IF(ISNUMBER(W7),W7,\"\")","v":""},{"$f":"IF(Indtastning!U19=\"\",\"\",Indtastning!U19)","v":""},{"$f":"IF(Indtastning!V19=\"\",\"\",Indtastning!V19)","v":""},{"$f":"IF(OR(Z7=\"\",Z7=0,Skjulte_Indstillinger!$B$6=FALSE()),#N/A,Y7/Z7)","v":{"$error":"#N/A"}},{"$f":"IF(ISNUMBER(AA7),AA7,\"\")","v":""},{"$f":"IF(Indtastning!X19=\"\",\"\",Indtastning!X19)","v":""},{"$f":"IF(Indtastning!Y19=\"\",\"\",Indtastning!Y19)","v":""},{"$f":"IF(OR(AD7=\"\",AD7=0,Skjulte_Indstillinger!$B$7=FALSE()),#N/A,AC7/AD7)","v":{"$error":"#N/A"}},{"$f":"IF(ISNUMBER(AE7),AE7,\"\")","v":""},{"$f":"IF(Indtastning!AA19=\"\",\"\",Indtastning!AA19)","v":""},{"$f":"IF(Indtastning!AB19=\"\",\"\",Indtastning!AB19)","v":""},{"$f":"IF(OR(AH7=\"\",AH7=0,Skjulte_Indstillinger!$B$8=FALSE()),#N/A,AG7/AH7)","v":{"$error":"#N/A"}},{"$f":"IF(ISNUMBER(AI7),AI7,\"\")","v":""},{"$f":"IF(Indtastning!AD19=\"\",\"\",Indtastning!AD19)","v":""},{"$f":"IF(Indtastning!AE19=\"\",\"\",Indtastning!AE19)","v":""},{"$f":"IF(OR(AL7=\"\",AL7=0,Skjulte_Indstillinger!$B$9=FALSE()),#N/A,AK7/AL7)","v":{"$error":"#N/A"}},{"$f":"IF(ISNUMBER(AM7),AM7,\"\")","v":""},{"$f":"IF(Indtastning!AG19=\"\",\"\",Indtastning!AG19)","v":""},{"$f":"IF(Indtastning!AH19=\"\",\"\",Indtastning!AH19)","v":""},{"$f":"IF(OR(AP7=\"\",AP7=0,Skjulte_Indstillinger!$B$10=FALSE()),#N/A,AO7/AP7)","v":{"$error":"#N/A"}},{"$f":"IF(ISNUMBER(AQ7),AQ7,\"\")","v":""},{"$f":"IF(Indtastning!G19=\"\",#N/A,Indtastning!G19)","v":{"$error":"#N/A"}},{"$error":"#N/A"},{"$f":"_xlfn.AGGREGATE(3,3,$AS$6:$AS7)","v":0},{"$f":"_xlfn.AGGREGATE(4,3,$G4:$G9)","v":0},{"$f":"_xlfn.AGGREGATE(5,3,$G4:$G9)","v":0},{"$f":"MAX(_xlfn.AGGREGATE(4,3,$G4:$G9),IFERROR($BR$5,0))","v":0},0,{"$f":"AW7-AY7","v":0},{"$f":"AX7-AV7","v":0},0,"","",{"$error":"#N/A"},{"$f":"IF(OR(BB7=1,BB8=1),$BF$4,#N/A)","v":{"$error":"#N/A"}},{"$f":"IF(BB7=0,BE7,BF7)","v":{"$error":"#N/A"}},{"$error":"#N/A"},{"$f":"IF(ISNUMBER(BH7),1,0)","v":0},"","",{"$f":"IF(BK7=0,BK6,BK7)","v":""},"",{"$f":"IF(OR(BL7=0,BL7=\"\"),0,IF(AND(BB7=1,BB6=0),1,IF(BL7=BL6,IF(BI7=1,BN6,BN6+1),1)))","v":0},{"$f":"IF(BK7=\"\",0,ABS(BK7))","v":0},{"$f":"IF(BB7=0,BN7,\"\")","v":0},{"$f":"IF(BB7=1,BN7,\"\")","v":""},{"$f":"$BR$5","v":{"$error":"#N/A"}},{"$error":"#N/A"},{"$f":"IF(AND(H7<>\"\",H8=\"\",OR(Skjulte_Indstillinger!$B$2,Skjulte_Indstillinger!$B$3,Skjulte_Indstillinger!$B$4,Skjulte_Indstillinger!$B$5,Skjulte_Indstillinger!$B$6,Skjulte_Indstillinger!$B$7,Skjulte_Indstillinger!$B$8,Skjulte_Indstillinger!$B$9,Skjulte_Indstillinger!$B$10)),H7,NA())","v":{"$error":"#N/A"}},{"$f":"IF(AND(L7<>\"\",L8=\"\",Skjulte_Indstillinger!$B$2),L7,NA())","v":{"$error":"#N/A"}},{"$f":"IF(AND(P7<>\"\",P8=\"\",Skjulte_Indstillinger!$B$3),P7,NA())","v":{"$error":"#N/A"}},{"$f":"IF(AND(T7<>\"\",T8=\"\",Skjulte_Indstillinger!$B$4),T7,NA())","v":{"$error":"#N/A"}},{"$f":"IF(AND(X7<>\"\",X8=\"\",Skjulte_Indstillinger!$B$5),X7,NA())","v":{"$error":"#N/A"}},{"$f":"IF(AND(AB7<>\"\",AB8=\"\",Skjulte_Indstillinger!$B$6),AB7,NA())","v":{"$error":"#N/A"}},{"$f":"IF(AND(AF7<>\"\",AF8=\"\",Skjulte_Indstillinger!$B$7),AF7,NA())","v":{"$error":"#N/A"}},{"$f":"IF(AND(AJ7<>\"\",AJ8=\"\",Skjulte_Indstillinger!$B$8),AJ7,NA())","v":{"$error":"#N/A"}},{"$f":"IF(AND(AN7<>\"\",AN8=\"\",Skjulte_Indstillinger!$B$9),AN7,NA())","v":{"$error":"#N/A"}},{"$f":"IF(AND(AR7<>\"\",AR8=\"\",Skjulte_Indstillinger!$B$10),AR7,NA())","v":{"$error":"#N/A"}}]
["",{"$f":"IF(Indtastning!B20=\"\",\"\",Indtastning!B20)","v":""},{"$f":"CELL(\"format\",Indtastning!B20)","v":"G"},"",{"$f":"IF(Indtastning!D20=\"\",\"\",Indtastning!D20)","v":""},{"$f":"IF(Indtastning!E20=\"\",\"\",Indtastning!E20)","v":""},{"$error":"#N/A"},"",{"$f":"IF(Indtastning!I20=\"\",\"\",Indtastning!I20)","v":""},{"$f":"IF(Indtastning!J20=\"\",\"\",Indtastning!J20)","v":""},{"$f":"IF(OR(J8=\"\",J8=0,Skjulte_Indstillinger!$B$2=FALSE()),#N/A,I8/J8)","v":{"$error":"#N/A"}},"",{"$f":"IF(Indtastning!L20=\"\",\"\",Indtastning!L20)","v":""},{"$f":"IF(Indtastning!M20=\"\",\"\",Indtastning!M20)","v":""},{"$f":"IF(OR(N8=\"\",N8=0,Skjulte_Indstillinger!$B$3=FALSE()),#N/A,M8/N8)","v":{"$error":"#N/A"}},"",{"$f":"IF(Indtastning!O20=\"\",\"\",Indtastning!O20)","v":""},{"$f":"IF(Indtastning!P20=\"\",\"\",Indtastning!P20)","v":""},{"$f":"IF(OR(R8=\"\",R8=0,Skjulte_Indstillinger!$B$4=FALSE()),#N/A,Q8/R8)","v":{"$error":"#N/A"}},"",{"$f":"IF(Indtastning!R20=\"\",\"\",Indtastning!R20)","v":""},{"$f":"IF(Indtastning!S20=\"\",\"\",Indtastning!S20)","v":""},{"$f":"IF(OR(V8=\"\",V8=0,Skjulte_Indstillinger!$B$5=FALSE()),#N/A,U8/V8)","v":{"$error":"#N/A"}},"",{"$f":"IF(Indtastning!U20=\"\",\"\",Indtastning!U20)","v":""},{"$f":"IF(Indtastning!V20=\"\",\"\",Indtastning!V20)","v":""},{"$f":"IF(OR(Z8=\"\",Z8=0,Skjulte_Indstillinger!$B$6=FALSE()),#N/A,Y8/Z8)","v":{"$error":"#N/A"}},"",{"$f":"IF(Indtastning!X20=\"\",\"\",Indtastning!X20)","v":""},{"$f":"IF(Indtastning!Y20=\"\",\"\",Indtastning!Y20)","v":""},{"$f":"IF(OR(AD8=\"\",AD8=0,Skjulte_Indstillinger!$B$7=FALSE()),#N/A,AC8/AD8)","v":{"$error":"#N/A"}},"",{"$f":"IF(Indtastning!AA20=\"\",\"\",Indtastning!AA20)","v":""},{"$f":"IF(Indtastning!AB20=\"\",\"\",Indtastning!AB20)","v":""},{"$f":"IF(OR(AH8=\"\",AH8=0,Skjulte_Indstillinger!$B$8=FALSE()),#N/A,AG8/AH8)","v":{"$error":"#N/A"}},"",{"$f":"IF(Indtastning!AD20=\"\",\"\",Indtastning!AD20)","v":""},{"$f":"IF(Indtastning!AE20=\"\",\"\",Indtastning!AE20)","v":""},{"$f":"IF(OR(AL8=\"\",AL8=0,Skjulte_Indstillinger!$B$9=FALSE()),#N/A,AK8/AL8)","v":{"$error":"#N/A"}},"",{"$f":"IF(Indtastning!AG20=\"\",\"\",Indtastning!AG20)","v":""},{"$f":"IF(Indtastning!AH20=\"\",\"\",Indtastning!AH20)","v":""},{"$f":"IF(OR(AP8=\"\",AP8=0,Skjulte_Indstillinger!$B$10=FALSE()),#N/A,AO8/AP8)","v":{"$error":"#N/A"}},"",{"$f":"IF(Indtastning!G20=\"\",#N/A,Indtastning!G20)","v":{"$error":"#N/A"}},{"$error":"#N/A"},{"$f":"_xlfn.AGGREGATE(3,3,$AS$6:$AS8)","v":0},0,0,0,0,0,0,0,"","",{"$error":"#N/A"},{"$error":"#N/A"},{"$error":"#N/A"},{"$error":"#N/A"},0,"","","","",0,0,0,"",{"$error":"#N/A"},{"$f":"IF(AND(A4<>\"\",A5=\"\"),BR8,#N/A)","v":{"$error":"#N/A"}},{"$f":"IF(AND(H8<>\"\",H9=\"\",OR(Skjulte_Indstillinger!$B$2,Skjulte_Indstillinger!$B$3,Skjulte_Indstillinger!$B$4,Skjulte_Indstillinger!$B$5,Skjulte_Indstillinger!$B$6,Skjulte_Indstillinger!$B$7,Skjulte_Indstillinger!$B$8,Skjulte_Indstillinger!$B$9,Skjulte_Indstillinger!$B$10)),H8,NA())","v":{"$error":"#N/A"}},{"$f":"IF(AND(L8<>\"\",L9=\"\",Skjulte_Indstillinger!$B$2),L8,NA())","v":{"$error":"#N/A"}},{"$f":"IF(AND(P8<>\"\",P9=\"\",Skjulte_Indstillinger!$B$3),P8,NA())","v":{"$error":"#N/A"}},{"$f":"IF(AND(T8<>\"\",T9=\"\",Skjulte_Indstillinger!$B$4),T8,NA())","v":{"$error":"#N/A"}},{"$f":"IF(AND(X8<>\"\",X9=\"\",Skjulte_Indstillinger!$B$5),X8,NA())","v":{"$error":"#N/A"}},{"$f":"IF(AND(AB8<>\"\",AB9=\"\",Skjulte_Indstillinger!$B$6),AB8,NA())","v":{"$error":"#N/A"}},{"$f":"IF(AND(AF8<>\"\",AF9=\"\",Skjulte_Indstillinger!$B$7),AF8,NA())","v":{"$error":"#N/A"}},{"$f":"IF(AND(AJ8<>\"\",AJ9=\"\",Skjulte_Indstillinger!$B$8),AJ8,NA())","v":{"$error":"#N/A"}},{"$f":"IF(AND(AN8<>\"\",AN9=\"\",Skjulte_Indstillinger!$B$9),AN8,NA())","v":{"$error":"#N/A"}},{"$f":"IF(AND(AR8<>\"\",AR9=\"\",Skjulte_Indstillinger!$B$10),AR8,NA())","v":{"$error":"#N/A"}}]
{"$rows_left_out":125}
{"sheet":"Distributionsliste","index":3,"n_rows":7,"n_cols":10,"rows_kept":7,"cut":false,"hidden":true,"merged":[]}
["Distribution af seriediagram"]
[]
["Gennemse emails før afsendelse :",null,"Ja"]
[]
[]
["Send","Sheets","File Name","To","Cc","Bcc","Subject","Attach other files","Body text","Importance"]
["ja",null,null,"johan@reventlow.dk",null,null,"hej",null,"hejsa"]

{"sheet":"Skjulte_Indstillinger","index":4,"n_rows":16,"n_cols":2,"rows_kept":16,"cut":false,"hidden":true,"merged":[]}
[]
["Proces 2",false]
["Proces 3",false]
["Proces 4",false]
["Proces 5",false]
["Proces 6",false]
["Proces 7",false]
["Proces 8",false]
{"$rows_left_out":9}
{"sheet":"Licens","index":5,"n_rows":21,"n_cols":3,"rows_kept":21,"cut":false,"hidden":false,"merged":[[3,1,4,1]]}
[]
[null,"DENNE EXCELFIL DELES UNDER EN CREATIVE COMMONS-LICENS"]
[null,"Licensen hedder Attribution-NonCommercial-ShareAlike 4.0 International"]
[null,"og den giver ret til at bruge, dele og tilpasse værktøjet, under forudsætning af: \n- at Bispebjerg og Frederiksberg Hospital krediteres\n- at værktøjet ikke anvendes i kommerciel sammenhæng\n- at tilpassede eller videreudviklede versioner af dette værktøj distribueres under samme licens."]
[]
[null,"Licensen er opsummeret her:"]
[null,"http://creativecommons.org/licenses/by-nc-sa/4.0/"]
[null,"Licensens fulde tekst kan læses her:"]
{"$rows_left_out":13}